FailedConsole Output

Started by user janv
Building in workspace /var/lib/jenkins/workspace/Geomajas Project SLD
 > git rev-parse --is-inside-work-tree # timeout=10
Fetching changes from the remote Git repository
 > git config remote.origin.url git@github.com:geomajas/geomajas-project-sld # timeout=10
Fetching upstream changes from git@github.com:geomajas/geomajas-project-sld
 > git --version # timeout=10
 > git -c core.askpass=true fetch --tags --progress git@github.com:geomajas/geomajas-project-sld +refs/heads/*:refs/remotes/origin/*
 > git rev-parse origin/master^{commit} # timeout=10
Checking out Revision 9e80c9d7872cb2cbf62f59df33fccaf26e4048bc (origin/master)
 > git config core.sparsecheckout # timeout=10
 > git checkout -f 9e80c9d7872cb2cbf62f59df33fccaf26e4048bc # timeout=10
 > git branch -a # timeout=10
 > git rev-parse master^{commit} # timeout=10
 > git rev-parse remotes/origin/master^{commit} # timeout=10
 > git branch -D master # timeout=10
 > git checkout -b master 9e80c9d7872cb2cbf62f59df33fccaf26e4048bc
 > git rev-list 9e80c9d7872cb2cbf62f59df33fccaf26e4048bc # timeout=10
Parsing POMs
[Geomajas Project SLD] $ /var/lib/jenkins/tools/hudson.model.JDK/JDK_6_45/bin/java -Xmx4096m -XX:PermSize=128m -XX:MaxPermSize=768m -Dforce.http.jre.executor=true -Dgwt.compiler.localWorkers=1 -cp /var/lib/jenkins/plugins/maven-plugin/WEB-INF/lib/maven31-agent-1.5.jar:/var/lib/jenkins/tools/hudson.tasks.Maven_MavenInstallation/maven/boot/plexus-classworlds-2.5.1.jar:/var/lib/jenkins/tools/hudson.tasks.Maven_MavenInstallation/maven/conf/logging jenkins.maven3.agent.Maven31Main /var/lib/jenkins/tools/hudson.tasks.Maven_MavenInstallation/maven /var/cache/jenkins/war/WEB-INF/lib/remoting-2.44.jar /var/lib/jenkins/plugins/maven-plugin/WEB-INF/lib/maven31-interceptor-1.5.jar /var/lib/jenkins/plugins/maven-plugin/WEB-INF/lib/maven3-interceptor-commons-1.5.jar 34554
<===[JENKINS REMOTING CAPACITY]===>channel started
Executing Maven:  -B -f /var/lib/jenkins/workspace/Geomajas Project SLD/pom.xml clean org.jacoco:jacoco-maven-plugin:0.7.4.201502262128:prepare-agent deploy
[INFO] Scanning for projects...
[WARNING] 
[WARNING] Some problems were encountered while building the effective model for org.geomajas.project:geomajas-project-sld-documentation:jar:1.3.0-SNAPSHOT
[WARNING] 'parent.relativePath' points at org.geomajas.project:geomajas-project-sld-all instead of org.geomajas:geomajas-doc-parent, please verify your project structure @ line 15, column 10
[WARNING] 
[WARNING] It is highly recommended to fix these problems because they threaten the stability of your build.
[WARNING] 
[WARNING] For this reason, future Maven versions might no longer support building such malformed projects.
[WARNING] 
[INFO] ------------------------------------------------------------------------
[INFO] Reactor Build Order:
[INFO] 
[INFO] Geomajas SLD project
[INFO] Geomajas SLD API
[INFO] Geomajas SLD implementation
[INFO] Geomajas SLD project documentation
[INFO] Geomajas Project Sld : Javadoc
[INFO]                                                                         
[INFO] ------------------------------------------------------------------------
[INFO] Building Geomajas SLD project 1.3.0-SNAPSHOT
[INFO] ------------------------------------------------------------------------
[INFO] 
[INFO] --- maven-clean-plugin:2.4.1:clean (default-clean) @ geomajas-project-sld-all ---
[INFO] Deleting /var/lib/jenkins/workspace/Geomajas Project SLD/target
[INFO] 
[INFO] --- jacoco-maven-plugin:0.7.4.201502262128:prepare-agent (default-cli) @ geomajas-project-sld-all ---
[INFO] argLine set to "-javaagent:/var/lib/jenkins/.m2/repository/org/jacoco/org.jacoco.agent/0.7.4.201502262128/org.jacoco.agent-0.7.4.201502262128-runtime.jar=destfile=/var/lib/jenkins/workspace/Geomajas Project SLD/target/jacoco.exec"
[INFO] 
[INFO] --- maven-enforcer-plugin:1.0:enforce (enforce-maven) @ geomajas-project-sld-all ---
[INFO] 
[INFO] --- maven-javadoc-plugin:2.8:jar (attach-javadocs) @ geomajas-project-sld-all ---
[INFO] Not executing Javadoc as the project is not a Java classpath-capable package
[INFO] 
[INFO] >>> maven-source-plugin:2.1.2:jar (default) > generate-sources @ geomajas-project-sld-all >>>
[INFO] 
[INFO] --- maven-enforcer-plugin:1.0:enforce (enforce-maven) @ geomajas-project-sld-all ---
[WARNING] Failed to getClass for org.apache.maven.plugin.source.SourceJarMojo
[INFO] 
[INFO] <<< maven-source-plugin:2.1.2:jar (default) < generate-sources @ geomajas-project-sld-all <<<
[INFO] 
[INFO] --- maven-source-plugin:2.1.2:jar (default) @ geomajas-project-sld-all ---
[INFO] 
[INFO] --- maven-checkstyle-plugin:2.5-DF:check (default) @ geomajas-project-sld-all ---
[INFO] 
[INFO] 
[INFO] --- maven-install-plugin:2.4:install (default-install) @ geomajas-project-sld-all ---
[INFO] Installing /var/lib/jenkins/workspace/Geomajas Project SLD/pom.xml to /var/lib/jenkins/.m2/repository/org/geomajas/project/geomajas-project-sld-all/1.3.0-SNAPSHOT/geomajas-project-sld-all-1.3.0-SNAPSHOT.pom
[INFO] 
[INFO] --- maven-deploy-plugin:2.7:deploy (default-deploy) @ geomajas-project-sld-all ---
[INFO] Downloading: http://apps.geomajas.org/nexus/content/repositories/snapshots/org/geomajas/project/geomajas-project-sld-all/1.3.0-SNAPSHOT/maven-metadata.xml
[INFO] Downloaded: http://apps.geomajas.org/nexus/content/repositories/snapshots/org/geomajas/project/geomajas-project-sld-all/1.3.0-SNAPSHOT/maven-metadata.xml (623 B at 5.0 KB/sec)
[INFO] Uploading: http://apps.geomajas.org/nexus/content/repositories/snapshots/org/geomajas/project/geomajas-project-sld-all/1.3.0-SNAPSHOT/geomajas-project-sld-all-1.3.0-20150615.075921-15.pom
[INFO] Uploaded: http://apps.geomajas.org/nexus/content/repositories/snapshots/org/geomajas/project/geomajas-project-sld-all/1.3.0-SNAPSHOT/geomajas-project-sld-all-1.3.0-20150615.075921-15.pom (5 KB at 42.3 KB/sec)
[INFO] Downloading: http://apps.geomajas.org/nexus/content/repositories/snapshots/org/geomajas/project/geomajas-project-sld-all/maven-metadata.xml
[INFO] Downloaded: http://apps.geomajas.org/nexus/content/repositories/snapshots/org/geomajas/project/geomajas-project-sld-all/maven-metadata.xml (304 B at 5.9 KB/sec)
[INFO] Uploading: http://apps.geomajas.org/nexus/content/repositories/snapshots/org/geomajas/project/geomajas-project-sld-all/1.3.0-SNAPSHOT/maven-metadata.xml
[INFO] Uploaded: http://apps.geomajas.org/nexus/content/repositories/snapshots/org/geomajas/project/geomajas-project-sld-all/1.3.0-SNAPSHOT/maven-metadata.xml (623 B at 5.7 KB/sec)
[INFO] Uploading: http://apps.geomajas.org/nexus/content/repositories/snapshots/org/geomajas/project/geomajas-project-sld-all/maven-metadata.xml
[INFO] Uploaded: http://apps.geomajas.org/nexus/content/repositories/snapshots/org/geomajas/project/geomajas-project-sld-all/maven-metadata.xml (304 B at 2.7 KB/sec)
[INFO]                                                                         
[INFO] ------------------------------------------------------------------------
[INFO] Building Geomajas SLD API 1.3.0-SNAPSHOT
[INFO] ------------------------------------------------------------------------
[WARNING] The artifact xstream:xstream:jar:1.2.2 has been relocated to com.thoughtworks.xstream:xstream:jar:1.2.2
[INFO] 
[INFO] --- maven-clean-plugin:2.4.1:clean (default-clean) @ geomajas-project-sld-api ---
[INFO] Deleting /var/lib/jenkins/workspace/Geomajas Project SLD/api/target
[INFO] 
[INFO] --- jacoco-maven-plugin:0.7.4.201502262128:prepare-agent (default-cli) @ geomajas-project-sld-api ---
[INFO] argLine set to "-javaagent:/var/lib/jenkins/.m2/repository/org/jacoco/org.jacoco.agent/0.7.4.201502262128/org.jacoco.agent-0.7.4.201502262128-runtime.jar=destfile=/var/lib/jenkins/workspace/Geomajas Project SLD/api/target/jacoco.exec"
[INFO] 
[INFO] --- maven-enforcer-plugin:1.0:enforce (enforce-maven) @ geomajas-project-sld-api ---
[INFO] 
[INFO] --- maven-resources-plugin:2.6:resources (default-resources) @ geomajas-project-sld-api ---
[INFO] Using 'UTF-8' encoding to copy filtered resources.
[INFO] Copying 2 resources
[INFO] Copying 1 resource
[INFO] 
[INFO] --- maven-compiler-plugin:2.3.2:compile (default-compile) @ geomajas-project-sld-api ---
[INFO] Compiling 157 source files to /var/lib/jenkins/workspace/Geomajas Project SLD/api/target/classes
[INFO] 
[INFO] --- maven-jibx-plugin:1.2.5:bind (bind) @ geomajas-project-sld-api ---
[INFO] Running JiBX binding compiler (single-module mode) on 1 binding file(s)
[INFO] 
[INFO] --- maven-resources-plugin:2.6:testResources (default-testResources) @ geomajas-project-sld-api ---
[INFO] Using 'UTF-8' encoding to copy filtered resources.
[INFO] Copying 31 resources
[INFO] 
[INFO] --- maven-compiler-plugin:2.3.2:testCompile (default-testCompile) @ geomajas-project-sld-api ---
[INFO] Compiling 10 source files to /var/lib/jenkins/workspace/Geomajas Project SLD/api/target/test-classes
[INFO] 
[INFO] --- maven-surefire-plugin:2.11:test (default-test) @ geomajas-project-sld-api ---
[INFO] Surefire report directory: /var/lib/jenkins/workspace/Geomajas Project SLD/api/target/surefire-reports

-------------------------------------------------------
 T E S T S
-------------------------------------------------------
org.apache.maven.surefire.util.SurefireReflectionException: java.lang.reflect.InvocationTargetException; nested exception is java.lang.reflect.InvocationTargetException: null
java.lang.reflect.InvocationTargetException
	at sun.reflect.NativeMethodAccessorImpl.invoke0(Native Method)
	at sun.reflect.NativeMethodAccessorImpl.invoke(NativeMethodAccessorImpl.java:39)
	at sun.reflect.DelegatingMethodAccessorImpl.invoke(DelegatingMethodAccessorImpl.java:25)
	at java.lang.reflect.Method.invoke(Method.java:597)
	at org.apache.maven.surefire.util.ReflectionUtils.invokeMethodWithArray(ReflectionUtils.java:188)
	at org.apache.maven.surefire.booter.ProviderFactory$ProviderProxy.invoke(ProviderFactory.java:166)
	at org.apache.maven.surefire.booter.ProviderFactory.invokeProvider(ProviderFactory.java:86)
	at org.apache.maven.surefire.booter.ForkedBooter.runSuitesInProcess(ForkedBooter.java:101)
	at org.apache.maven.surefire.booter.ForkedBooter.main(ForkedBooter.java:74)
Caused by: java.lang.UnsupportedClassVersionError: org/geotools/xml/Configuration : Unsupported major.minor version 51.0
	at java.lang.ClassLoader.defineClass1(Native Method)
	at java.lang.ClassLoader.defineClassCond(ClassLoader.java:631)
	at java.lang.ClassLoader.defineClass(ClassLoader.java:615)
	at java.security.SecureClassLoader.defineClass(SecureClassLoader.java:141)
	at java.net.URLClassLoader.defineClass(URLClassLoader.java:283)
	at java.net.URLClassLoader.access$000(URLClassLoader.java:58)
	at java.net.URLClassLoader$1.run(URLClassLoader.java:197)
	at java.security.AccessController.doPrivileged(Native Method)
	at java.net.URLClassLoader.findClass(URLClassLoader.java:190)
	at java.lang.ClassLoader.loadClass(ClassLoader.java:306)
	at sun.misc.Launcher$AppClassLoader.loadClass(Launcher.java:301)
	at java.lang.ClassLoader.loadClass(ClassLoader.java:247)
	at java.lang.Class.getDeclaredMethods0(Native Method)
	at java.lang.Class.privateGetDeclaredMethods(Class.java:2436)
	at java.lang.Class.getMethod0(Class.java:2679)
	at java.lang.Class.getMethod(Class.java:1605)
	at org.apache.maven.surefire.util.ReflectionUtils.tryGetMethod(ReflectionUtils.java:57)
	at org.apache.maven.surefire.common.junit3.JUnit3TestChecker.isSuiteOnly(JUnit3TestChecker.java:65)
	at org.apache.maven.surefire.common.junit3.JUnit3TestChecker.isValidJUnit3Test(JUnit3TestChecker.java:60)
	at org.apache.maven.surefire.common.junit3.JUnit3TestChecker.accept(JUnit3TestChecker.java:55)
	at org.apache.maven.surefire.common.junit4.JUnit4TestChecker.accept(JUnit4TestChecker.java:52)
	at org.apache.maven.surefire.util.DefaultDirectoryScanner.locateTestClasses(DefaultDirectoryScanner.java:71)
	at org.apache.maven.surefire.junit4.JUnit4Provider.scanClassPath(JUnit4Provider.java:184)
	at org.apache.maven.surefire.junit4.JUnit4Provider.invoke(JUnit4Provider.java:93)
	... 9 more

Results :

Tests run: 0, Failures: 0, Errors: 0, Skipped: 0

[JENKINS] Recording test results
[INFO] ------------------------------------------------------------------------
[INFO] Reactor Summary:
[INFO] 
[INFO] Geomajas SLD project ............................... SUCCESS [  2.939 s]
[INFO] Geomajas SLD API ................................... FAILURE [  4.816 s]
[INFO] Geomajas SLD implementation ........................ SKIPPED
[INFO] Geomajas SLD project documentation ................. SKIPPED
[INFO] Geomajas Project Sld : Javadoc ..................... SKIPPED
[INFO] ------------------------------------------------------------------------
[INFO] BUILD FAILURE
[INFO] ------------------------------------------------------------------------
[INFO] Total time: 8.428 s
[INFO] Finished at: 2015-06-15T09:59:26+02:00
[INFO] Final Memory: 54M/525M
[INFO] ------------------------------------------------------------------------
[ERROR] Failed to execute goal org.apache.maven.plugins:maven-surefire-plugin:2.11:test (default-test) on project geomajas-project-sld-api: Error occured in starting fork, check output in log -> [Help 1]
[ERROR] 
[ERROR] To see the full stack trace of the errors, re-run Maven with the -e switch.
[ERROR] Re-run Maven using the -X switch to enable full debug logging.
[ERROR] 
[ERROR] For more information about the errors and possible solutions, please read the following articles:
[JENKINS] Archiving /var/lib/jenkins/workspace/Geomajas Project SLD/api/pom.xml to org.geomajas.project/geomajas-project-sld-api/1.3.0-SNAPSHOT/geomajas-project-sld-api-1.3.0-SNAPSHOT.pom
[ERROR] [Help 1] http://cwiki.apache.org/confluence/display/MAVEN/MojoExecutionException
[ERROR] 
[ERROR] After correcting the problems, you can resume the build with the command
[ERROR]   mvn <goals> -rf :geomajas-project-sld-api
[JENKINS] Archiving /var/lib/jenkins/workspace/Geomajas Project SLD/javadoc/pom.xml to org.geomajas.project/geomajas-project-sld-javadoc/1.3.0-SNAPSHOT/geomajas-project-sld-javadoc-1.3.0-SNAPSHOT.pom
[JENKINS] Archiving /var/lib/jenkins/workspace/Geomajas Project SLD/documentation/pom.xml to org.geomajas.project/geomajas-project-sld-documentation/1.3.0-SNAPSHOT/geomajas-project-sld-documentation-1.3.0-SNAPSHOT.pom
[JENKINS] Archiving /var/lib/jenkins/workspace/Geomajas Project SLD/pom.xml to org.geomajas.project/geomajas-project-sld-all/1.3.0-SNAPSHOT/geomajas-project-sld-all-1.3.0-SNAPSHOT.pom
[JENKINS] Archiving /var/lib/jenkins/workspace/Geomajas Project SLD/impl/pom.xml to org.geomajas.project/geomajas-project-sld-impl/1.3.0-SNAPSHOT/geomajas-project-sld-impl-1.3.0-SNAPSHOT.pom
channel stopped
Skipping sonar analysis due to bad build status FAILURE
Sending e-mails to: geomajas-commits@lists.sourceforge.net
Finished: FAILURE