FailedConsole Output

Started by an SCM change
Building in workspace /var/lib/jenkins/workspace/Geomajas Project build tools
 > git rev-parse --is-inside-work-tree # timeout=10
Fetching changes from the remote Git repository
 > git config remote.origin.url git@github.com:geomajas/geomajas-build-tools # timeout=10
Fetching upstream changes from git@github.com:geomajas/geomajas-build-tools
 > git --version # timeout=10
 > git -c core.askpass=true fetch --tags --progress git@github.com:geomajas/geomajas-build-tools +refs/heads/*:refs/remotes/origin/*
 > git rev-parse origin/master^{commit} # timeout=10
Checking out Revision c73979545ef88e54136b0536eb4ecde6adecb9d9 (origin/master)
 > git config core.sparsecheckout # timeout=10
 > git checkout -f c73979545ef88e54136b0536eb4ecde6adecb9d9 # timeout=10
 > git branch -a # timeout=10
 > git rev-parse master^{commit} # timeout=10
 > git rev-parse remotes/origin/2.4.0-START^{commit} # timeout=10
 > git rev-parse remotes/origin/2.6.0-START^{commit} # timeout=10
 > git rev-parse remotes/origin/BUTO-39^{commit} # timeout=10
 > git rev-parse remotes/origin/jandm-release-gwt2-server^{commit} # timeout=10
 > git rev-parse remotes/origin/master^{commit} # timeout=10
 > git branch -D master # timeout=10
 > git checkout -b master c73979545ef88e54136b0536eb4ecde6adecb9d9
 > git rev-list 4ded7e8fa9833cc05f8a72bc725691b66cc7e5fa # timeout=10
Parsing POMs
Modules changed, recalculating dependency graph
[Geomajas Project build tools] $ /var/lib/jenkins/tools/hudson.model.JDK/JDK_6_45/bin/java -Xmx4096m -XX:PermSize=128m -XX:MaxPermSize=768m -Dforce.http.jre.executor=true -Dgwt.compiler.localWorkers=1 -cp /var/lib/jenkins/plugins/maven-plugin/WEB-INF/lib/maven31-agent-1.5.jar:/var/lib/jenkins/tools/hudson.tasks.Maven_MavenInstallation/maven/boot/plexus-classworlds-2.5.1.jar:/var/lib/jenkins/tools/hudson.tasks.Maven_MavenInstallation/maven/conf/logging jenkins.maven3.agent.Maven31Main /var/lib/jenkins/tools/hudson.tasks.Maven_MavenInstallation/maven /var/cache/jenkins/war/WEB-INF/lib/remoting-2.53.2.jar /var/lib/jenkins/plugins/maven-plugin/WEB-INF/lib/maven31-interceptor-1.5.jar /var/lib/jenkins/plugins/maven-plugin/WEB-INF/lib/maven3-interceptor-commons-1.5.jar 48406
<===[JENKINS REMOTING CAPACITY]===>channel started
ERROR: [JENKINS-18403] JDK 5 not supported to run Maven; retrying with slave Java and setting compile/test properties to point to /var/lib/jenkins/tools/hudson.model.JDK/JDK_6_45
[Geomajas Project build tools] $ /usr/lib/jvm/java-7-oracle/jre/bin/java -Xmx4096m -XX:PermSize=128m -XX:MaxPermSize=768m -Dforce.http.jre.executor=true -Dgwt.compiler.localWorkers=1 -cp /var/lib/jenkins/plugins/maven-plugin/WEB-INF/lib/maven31-agent-1.5.jar:/var/lib/jenkins/tools/hudson.tasks.Maven_MavenInstallation/maven/boot/plexus-classworlds-2.5.1.jar:/var/lib/jenkins/tools/hudson.tasks.Maven_MavenInstallation/maven/conf/logging jenkins.maven3.agent.Maven31Main /var/lib/jenkins/tools/hudson.tasks.Maven_MavenInstallation/maven /var/cache/jenkins/war/WEB-INF/lib/remoting-2.53.2.jar /var/lib/jenkins/plugins/maven-plugin/WEB-INF/lib/maven31-interceptor-1.5.jar /var/lib/jenkins/plugins/maven-plugin/WEB-INF/lib/maven3-interceptor-commons-1.5.jar 37473
<===[JENKINS REMOTING CAPACITY]===>channel started
Executing Maven:  -B -f /var/lib/jenkins/workspace/Geomajas Project build tools/pom.xml clean org.jacoco:jacoco-maven-plugin:prepare-agent deploy
[INFO] Scanning for projects...
[INFO] ------------------------------------------------------------------------
[INFO] Reactor Build Order:
[INFO] 
[INFO] geomajas-build-tools
[INFO] Geomajas checkstyle configuration
[INFO] Geomajas Jetty runner
[INFO] Geomajas maven plugin
[INFO] Geomajas documentation JDocBook styles
[INFO]                                                                         
[INFO] ------------------------------------------------------------------------
[INFO] Building geomajas-build-tools 2.6.0-SNAPSHOT
[INFO] ------------------------------------------------------------------------
[INFO] 
[INFO] --- maven-clean-plugin:2.5:clean (default-clean) @ geomajas-build-tools ---
[INFO] 
[INFO] --- jacoco-maven-plugin:0.7.7.201606060606:prepare-agent (default-cli) @ geomajas-build-tools ---
[INFO] argLine set to "-javaagent:/var/lib/jenkins/.m2/repository/org/jacoco/org.jacoco.agent/0.7.7.201606060606/org.jacoco.agent-0.7.7.201606060606-runtime.jar=destfile=/var/lib/jenkins/workspace/Geomajas Project build tools/target/jacoco.exec"
[INFO] 
[INFO] --- maven-enforcer-plugin:1.0:enforce (enforce-maven) @ geomajas-build-tools ---
[INFO] 
[INFO] --- maven-install-plugin:2.4:install (default-install) @ geomajas-build-tools ---
[INFO] Installing /var/lib/jenkins/workspace/Geomajas Project build tools/pom.xml to /var/lib/jenkins/.m2/repository/org/geomajas/project/geomajas-build-tools/2.6.0-SNAPSHOT/geomajas-build-tools-2.6.0-SNAPSHOT.pom
[INFO] 
[INFO] --- maven-deploy-plugin:2.7:deploy (default-deploy) @ geomajas-build-tools ---
[INFO] Downloading: http://apps.geomajas.org/nexus/content/repositories/snapshots/org/geomajas/project/geomajas-build-tools/2.6.0-SNAPSHOT/maven-metadata.xml
[INFO] Downloaded: http://apps.geomajas.org/nexus/content/repositories/snapshots/org/geomajas/project/geomajas-build-tools/2.6.0-SNAPSHOT/maven-metadata.xml (619 B at 1.0 KB/sec)
[INFO] Uploading: http://apps.geomajas.org/nexus/content/repositories/snapshots/org/geomajas/project/geomajas-build-tools/2.6.0-SNAPSHOT/geomajas-build-tools-2.6.0-20160614.075500-19.pom
[INFO] Uploaded: http://apps.geomajas.org/nexus/content/repositories/snapshots/org/geomajas/project/geomajas-build-tools/2.6.0-SNAPSHOT/geomajas-build-tools-2.6.0-20160614.075500-19.pom (4 KB at 6.2 KB/sec)
[INFO] Downloading: http://apps.geomajas.org/nexus/content/repositories/snapshots/org/geomajas/project/geomajas-build-tools/maven-metadata.xml
[INFO] Downloaded: http://apps.geomajas.org/nexus/content/repositories/snapshots/org/geomajas/project/geomajas-build-tools/maven-metadata.xml (600 B at 4.8 KB/sec)
[INFO] Uploading: http://apps.geomajas.org/nexus/content/repositories/snapshots/org/geomajas/project/geomajas-build-tools/2.6.0-SNAPSHOT/maven-metadata.xml
[INFO] Uploaded: http://apps.geomajas.org/nexus/content/repositories/snapshots/org/geomajas/project/geomajas-build-tools/2.6.0-SNAPSHOT/maven-metadata.xml (619 B at 6.8 KB/sec)
[INFO] Uploading: http://apps.geomajas.org/nexus/content/repositories/snapshots/org/geomajas/project/geomajas-build-tools/maven-metadata.xml
[INFO] Uploaded: http://apps.geomajas.org/nexus/content/repositories/snapshots/org/geomajas/project/geomajas-build-tools/maven-metadata.xml (600 B at 4.6 KB/sec)
[INFO]                                                                         
[INFO] ------------------------------------------------------------------------
[INFO] Building Geomajas checkstyle configuration 2.6.0-SNAPSHOT
[INFO] ------------------------------------------------------------------------
[INFO] 
[INFO] --- maven-clean-plugin:2.5:clean (default-clean) @ geomajas-checkstyle ---
[INFO] Deleting /var/lib/jenkins/workspace/Geomajas Project build tools/geomajas-checkstyle/target
[INFO] 
[INFO] --- jacoco-maven-plugin:0.7.7.201606060606:prepare-agent (default-cli) @ geomajas-checkstyle ---
[INFO] argLine set to "-javaagent:/var/lib/jenkins/.m2/repository/org/jacoco/org.jacoco.agent/0.7.7.201606060606/org.jacoco.agent-0.7.7.201606060606-runtime.jar=destfile=/var/lib/jenkins/workspace/Geomajas Project build tools/geomajas-checkstyle/target/jacoco.exec"
[INFO] 
[INFO] --- maven-enforcer-plugin:1.0:enforce (enforce-maven) @ geomajas-checkstyle ---
[INFO] 
[INFO] --- maven-resources-plugin:2.6:resources (default-resources) @ geomajas-checkstyle ---
[INFO] Using 'UTF-8' encoding to copy filtered resources.
[INFO] Copying 11 resources
[INFO] 
[INFO] --- maven-compiler-plugin:2.3.2:compile (default-compile) @ geomajas-checkstyle ---
[INFO] Compiling 3 source files to /var/lib/jenkins/workspace/Geomajas Project build tools/geomajas-checkstyle/target/classes
[INFO] -------------------------------------------------------------
[ERROR] COMPILATION ERROR : 
[INFO] -------------------------------------------------------------
[ERROR] Failure executing javac,  but could not parse the error:
javac: invalid target release: 1.7
Usage: javac <options> <source files>
use -help for a list of possible options

[INFO] 1 error
[INFO] -------------------------------------------------------------
[INFO] ------------------------------------------------------------------------
[INFO] Reactor Summary:
[INFO] 
[INFO] geomajas-build-tools ............................... SUCCESS [  2.990 s]
[INFO] Geomajas checkstyle configuration .................. FAILURE [  0.548 s]
[INFO] Geomajas Jetty runner .............................. SKIPPED
[INFO] Geomajas maven plugin .............................. SKIPPED
[INFO] Geomajas documentation JDocBook styles ............. SKIPPED
[INFO] ------------------------------------------------------------------------
[INFO] BUILD FAILURE
[INFO] ------------------------------------------------------------------------
[INFO] Total time: 4.409 s
[INFO] Finished at: 2016-06-14T09:55:03+02:00
[INFO] Final Memory: 20M/324M
[INFO] ------------------------------------------------------------------------
[ERROR] Failed to execute goal org.apache.maven.plugins:maven-compiler-plugin:2.3.2:compile (default-compile) on project geomajas-checkstyle: Compilation failure
[ERROR] Failure executing javac,  but could not parse the error:
[ERROR] javac: invalid target release: 1.7
[ERROR] Usage: javac <options> <source files>
[ERROR] use -help for a list of possible options
[ERROR] -> [Help 1]
[ERROR] 
[ERROR] To see the full stack trace of the errors, re-run Maven with the -e switch.
[ERROR] Re-run Maven using the -X switch to enable full debug logging.
[ERROR] 
[ERROR] For more information about the errors and possible solutions, please read the following articles:
[ERROR] [Help 1] http://cwiki.apache.org/confluence/display/MAVEN/MojoFailureException
[ERROR] 
[ERROR] After correcting the problems, you can resume the build with the command
[ERROR]   mvn <goals> -rf :geomajas-checkstyle
[JENKINS] Archiving /var/lib/jenkins/workspace/Geomajas Project build tools/pom.xml to org.geomajas.project/geomajas-build-tools/2.6.0-SNAPSHOT/geomajas-build-tools-2.6.0-SNAPSHOT.pom
[JENKINS] Archiving /var/lib/jenkins/workspace/Geomajas Project build tools/geomajas-maven-plugin/pom.xml to org.geomajas/geomajas-maven-plugin/2.6.0-SNAPSHOT/geomajas-maven-plugin-2.6.0-SNAPSHOT.pom
[JENKINS] Archiving /var/lib/jenkins/workspace/Geomajas Project build tools/geomajas-jetty-runner/pom.xml to org.geomajas/geomajas-jetty-runner/2.6.0-SNAPSHOT/geomajas-jetty-runner-2.6.0-SNAPSHOT.pom
[JENKINS] Archiving /var/lib/jenkins/workspace/Geomajas Project build tools/geomajas-jdocbook-style/pom.xml to org.geomajas.documentation/geomajas-jdocbook-style/2.6.0-SNAPSHOT/geomajas-jdocbook-style-2.6.0-SNAPSHOT.pom
[JENKINS] Archiving /var/lib/jenkins/workspace/Geomajas Project build tools/geomajas-checkstyle/pom.xml to org.geomajas/geomajas-checkstyle/2.6.0-SNAPSHOT/geomajas-checkstyle-2.6.0-SNAPSHOT.pom
channel stopped
Sending e-mails to: geomajas-commits@lists.sourceforge.net
Finished: FAILURE